{"text_format":"1","workbook":"xlsx","n_sheets":4,"sheets":["Certificación Relación Mensual","Contador","Importes","Campos a Cubrir"],"not_rendered":{"charts":0,"images":3,"macros":1,"external_links":0,"defined_names":6,"comments":0,"pivot_tables":0},"unopened":[],"bounds":{"document_bytes":16777216,"sheet_cells":100000,"rows_first":2000,"rows_last":500,"rows_between":2000,"halvings":0,"cell_chars":16384,"cell_head_chars":4096},"cells_cut":0,"cells_raw":0,"read":"whole","date_system":"1900"}

{"sheet":"Certificación Relación Mensual","index":0,"n_rows":63,"n_cols":174,"rows_kept":63,"cut":false,"hidden":false,"merged":[[7,7,7,8],[1,7,1,11],[2,7,2,11],[3,7,3,11],[8,37,8,38],[2,12,2,14],[2,16,2,33],[1,12,1,33],[3,12,3,33]]}
["IdN","IdX","ACHE","Proc","Num",null,"Meses",7,8,9,10,11,12,1,2,3,4,null,null,null,null,null,null,null,null,null,null,null,5,6,"Xornada","Achega","Dias","Contía","%PPE","Diascp","P.P. Extra","%CV","Diascv","Vacacións","NÓMINA",null,"IT","Baixa",null,null,null,null,null,null,null,null,"","","","","","","","","","","","",null,null,null,null,1,2,3,4,5,6,7,8,9,10,11,12,13,14,15,16,17,18,19,20,21,22,23,24,25,26,27,28,{"$f":"IF(DAY(VALUE(1&\"-\"&$AT$7&\"-\"&$AU$7)-1)>28,29,\"\")","v":29},{"$f":"IF(DAY(VALUE(1&\"-\"&$AT$7&\"-\"&$AU$7)-1)>29,30,\"\")","v":30},{"$f":"IF(DAY(VALUE(1&\"-\"&$AT$7&\"-\"&$AU$7)-1)>30,31,\"\")","v":31},"Trab.","Baixa",null,null,null,null,null,null,"inimes","finmes","diasnomina","diasbaixa","dbaixa","dalta","dbaixaat","dbaixait","Dias baixa mes","Diasconsumidos","Totdiasbaixa","ya subv.","Pedientes","DatainiCV","DiasCV","filas","Folla","Follas","1ºS 3","resto","os 12","- os 3 1ºS","os 12","Pago","Alt","Baix","NÓMINA","Data_nómina"]
[null,"area de impresión",null,null,null,null,null,"C.E.E. Solicitante",null,null,null,null,null,null,null,null,null,null,null,null,null,null,null,null,null,null,null,null,null,null,null,null,null,null,null,null,null,null,null,null,null,null,null,null,null,null,null,null,null,null,null,null,null,null,null,null,null,null,null,null,null,null,null,null,null,null,null,null,null,"Decembro","Xaneiro","Febreiro","Marzo","Abril","Maio ","Xuño","Xullo","Agosto","Setembro"]
[null,"de",null,null,"A1",null,null,"DNI/NIF:",null,null,null,null,null,null,null,"NºExp",null,null,null,null,null,null,null,null,null,null,null,null,null,null,null,null,null,null,null,null,null,null," Certificación mensual da relación do cadro de persoal c/discapaciade",null,null,null,null,null,null,null,null,null,null,null,null,null,null,null,null,null,null,null,null,null,null,null,null,null,null,null,null,null,null,12,1,2,3,4,5,6,7,8,9,null,null,null,null,null,null,null,null,null,null,null,null,null,null,null,null,null,null,null,null,null,null,null,null,null,null,null,null,null,null,null,null,null,null,null,null,null,null,null,null,null,null,null,null,null,null,null,null,null,null,null,null,null,null,null,null,null,null,null,null,null,null,null,null,null,null,null,null,null,null,null,null,{"$f":"VALUE(1&\"-\"&$EV$6&\"-\"&$EW$6)-1","v":"2024-12-31"}]
[null,"a",null,null,{"$f":"\"AV\"&IF(MAXA(B2:B60)=0,11,11+MAXA(B12:B60))","v":"AV12"},null,null,"Nome da persoa representante:",null,null,null,null,null,null,null,null,null,null,null,null,null,null,null,null,null,null,null,null,null,null,null,null,null,null,null,null,null,null,null,null,null,null,null,null,null,null,null,null,null,null,null,null,null,null,null,null,null,null,null,null,null,null,null,null,null,null,null,null,null,"Decembro","Xaneiro","Febreiro","Marzo","Abril","Maio ","Xuño","Xullo","Agosto","Setembro"]
[null,null,null,null,null,null,null,"Tipo de Axuda: Subvencion para a financiación do custo salarial de todas a persoas traballadoras con discapacidade contratadas en C.E.E. do territorio da Comunadade Autónoma de Galicia",null,null,null,null,null,null,null,null,null,null,null,null,null,null,null,null,null,null,null,null,null,null,null,null,null,null,null,null,null,null,null,null,null,null,null,null,null,null,{"$f":"VALUE(1&\"-\"&$AT$7&\"-\"&$AU$7)-1","v":"2025-01-31"},null,null,null,null,null,null,null,null,null,null,null,null,null,"S    U    X    E    R    I    D    O",null,null,null,null,null,null,{"$f":"IF(IFERROR(VLOOKUP(#REF!,$AT$12:$AT$60,1,FALSE),\"\")=\"\",\"\",1)","v":""},null,null,null,null,null,null,null,null,null,null,null,null,null,null,null,null,null,null,null,null,null,null,null,null,null,null,null,null,null,null,null,null,null,null,null,null,null,null,null,null,null,null,null,null,null,null,null,null,null,null,null,null,null,null,null,null,null,null,null,null,null,null,null,null,null,null,null,null,null,null,null,null,null,null,null,null,null,null,null,null,null,null,null,"mes","año"]
[null,null,null,null,null,null,"Desde",{"$f":"IF($AU$5=VALUE(30&\"/\"&6&\"/\"&YEAR($AU$5)),\"Verán\",IF($AU$5=VALUE(31&\"/\"&12&\"/\"&YEAR($AU$5)),\"Inverno\",\"\"))","v":""},"Data_nómina",null,null,null,null,"50%SMI","65%SMI",null,"Tot",null,null,null,null,null,null,null,null,null,null,"Tot.P.",0,0,"Programa III: Programa de axudas ao mantemento do custo salarial nos C.E.E. (Procedemento TR341M)",null,null,null,null,null,null,null,null,null,null,null,null,null,null,"mes","ano",null,null,null,null,null,null,null,null,null,null,null,null,"Totais","Achega Mes",null,null,"P.P.Extra",null,null,"Vacacións",null,{"$f":"VALUE(BQ11&\"/\"&MONTH($AU$5)&\"/\"&YEAR($AU$5))","v":"2025-01-01"},"2025-01-02","2025-01-03","2025-01-04","2025-01-05","2025-01-06","2025-01-07","2025-01-08","2025-01-09","2025-01-10","2025-01-11","2025-01-12","2025-01-13","2025-01-14","2025-01-15","2025-01-16","2025-01-17","2025-01-18","2025-01-19","2025-01-20","2025-01-21","2025-01-22","2025-01-23","2025-01-24","2025-01-25","2025-01-26","2025-01-27","2025-01-28","2025-01-29","2025-01-30","2025-01-31",null,null,null,null,null,null,null,null,null,null,null,null,null,null,"SI(AK13=\"AT\";CO13;0)",null,null,null,null,null,null,null,null,null,null,null,null,null,null,"Convenio",null,null,null,null,null,null,null,null,null,null,null,null,null,null,null,null,null,null,null,null,null,null,{"$f":"IF(MONTH(AR7)+1>12,MONTH(AR7)+1-12,MONTH(AR7)+1)","v":1},{"$f":"IF(MONTH(AR7)+1>12,YEAR(AR7)+1,YEAR(AR7))","v":2025}]
["Novo ",null,"Tot. Trab. CEE/RNT",null,null,null,"Certificación do cadro de ",null,{"$f":"VALUE(\"1/\"&HLOOKUP(H8,BR2:CC3,2,FALSE)&\"/\"&(IF(HLOOKUP(H8,BR2:CDO3,2,FALSE)<12,YEAR(AR7)+1,YEAR(AR7))))","v":"2025-01-01"},null,"Cert.comprobada",null,"Si",{"$f":"COUNTIFS($J$11:$J$61,P7,$C$11:$C$61,0,$AO$11:$AO$61,\"SI\")","v":0},{"$f":"COUNTIFS($J$11:$J$61,P7,$C$11:$C$61,1,$AO$11:$AO$61,\"SI\")","v":0},"H","P.Trab",null,null,null,null,null,null,null,null,null,null,"Trab.",null,{"$f":"AB8","v":0},"Total  Achega mes",null,null,{"$f":"VALUE(SUBTOTAL(109,AH11:AH61))","v":0},"P.Extra",null,{"$f":"SUBTOTAL(9,AK12:AK60)","v":0},"T.c.Vacacións",null,{"$f":"SUBTOTAL(9,AN11:AN61)","v":0},null,"Periodo",null,"2024-12-01",{"$f":"EDATE(AR7,1)-1","v":"2024-12-31"},{"$f":"IF(MONTH(AH8)+1>12,MONTH(AH8)+1-12,MONTH(AH8)+1)","v":2},{"$f":"IF(MONTH(AH8)+1>12,YEAR(AH8)+1,YEAR(AH8))","v":2025},null,null,null,null,null,null,"Anexo X",null,null,null,null,null,null,{"$f":"SUBTOTAL(9,BI12:BI60)","v":0},null,null,{"$f":"SUBTOTAL(9,BL12:BL60)","v":0},null,null,{"$f":"SUBTOTAL(9,BO12:BO18060)","v":0},null,null,null,null,null,null,null,null,null,null,null,null,null,null,null,null,null,null,null,null,null,null,null,null,null,null,null,null,null,null,null,null,null,null,"IT",15]
["IdX",{"$f":"MAXA(B12:B73)","v":1},"% Trab. c/discap.",null,null,{"$f":"IFERROR(AH9/F7,0)","v":0},"persoal do mes de ","Xaneiro",null,null,"Calculo correcto?",null,"Si",{"$f":"COUNTIFS($J$11:$J$61,P8,$C$11:$C$61,0,$AO$11:$AO$61,\"SI\")","v":0},{"$f":"COUNTIFS($J$11:$J$61,P8,$C$11:$C$61,1,$AO$11:$AO$61,\"SI\")","v":0},"M",{"$f":"SUM(N7:O8)","v":0},null,null,null,null,null,null,null,null,null,null,{"$f":"SUM(N7:O8)","v":0},null,{"$f":"AB8*180/30","v":0},"Ordinaria",null,"x",{"$f":"I7","v":"2025-01-01"},"Semestal",null,null,"Tot. Certificación mes de",null,null,null,"Convc.Axudas",null,{"$f":"AS7+1","v":"2025-01-01"},{"$f":"EDATE(AR8,9)-1","v":"2025-09-30"},"mes","ano",null,null,null,null,null,null,null,null,null,null,null,null,null,null,null,null,null,null,null,null,null,null,null,null,null,null,null,null,null,null,null,null,null,null,null,null,null,null,null,null,null,null,null,null,null,null,null,null,null,null,null,null,null,null,"AT",1,null,{"$f":"DY8","v":"NON"},null,null,null,null,null,null,null,null,null,null,null,null,null,null,null,null,null,null,null,null,null,null,null,{"$f":"AS9","v":"NON"},null,null,null,null,null,null,null,null,null,null,null,null,null,null,null,null,null,null,null,null,null,"incio",null,null,null,null,null,null,null,null,null,null,null,"fin"]
[{"$f":"MAXA(A11:A61)+1","v":1},null,"G","Cod","Salario mes",null,null,null,null,null,null,null,null,null,null,null,null,null,null,null,null,null,null,null,null,null,null,null,null,null,"Tot. P. Trab. mes",null,null,{"$f":"COUNTIF(AO11:AO61,\"SI\")","v":0},null,null,"Total Anexo X",{"$f":"H8","v":"Xaneiro"},null,{"$f":"AN7+AK7+AH7","v":0},null,null,null,"Conv. IT","NON",null,null,null,null,null,null,null,null,null,null,null,null,null,null,null,"Total Xeral mes de",null,{"$f":"H8","v":"Xaneiro"},null,null,null,{"$f":"BO7+BL7+BI7","v":0},null,null,null,null,null,null,null,null,null,null,null,null,null,null,null,null,null,null,null,null,null,null,null,null,null,null,null,null,null,null,null,null,null,null,"Total","Días","Días","Días",null,{"$f":"COLUMN()","v":107},null,null,null,null,null,null,null,null,null,null,null,null,null,null,null,null,null,null,null,null,null,null,null,null,null,null,null,null,null,null,null,null,null,null,null,null,null,null,null,null,null,null,null,7,8,9,10,11,12,1,2,3,4,5,6]
["IdX","IdN",null,null,"Convenio","Nº Rexistro","Traballador",null,"Data",null,null,null,null,"Data","Data","Código","Tipo ",null,null,null,null,null,null,null,null,null,null,null,null,null,"%","Tipo",null,"Achega","%",null,"Comp.","%",null,"Comp.",null,"Dias","IT","I T  /  A T",null,"Conv",null,null,null,"Xust",null,"INF.","Copia ","Comun.","Anexo",null,null,"Anexo","%","Dias","Achega Mensual","%","Dias","Comp.","%","Dias","Comp.",null,"C","A","L","E","N","D","A","R","I","O",null,"D","E",null,"T","R","A","B","A","L","L","O",null,"D","O",null,"M","E","S",null,null,"Días","Días","Días","Baixa","Baixa","Baixa",null,null,null,null,null,null,null,null,null,null,null,null,null,null,null,null,null,null,null,null,"tres primeros",null,null,null,null,null,null,null,null,null,null,"Dias  1º","1º Período",null,null,null,null,"Dias  2º","2º Periodo",null,null,null,null,null,null,{"$f":"$AR$7","v":"2024-12-01"},{"$f":"EU11+1","v":"2025-01-01"},{"$f":"EV11+1","v":"2025-02-01"},"2025-03-01","2025-04-01","2025-05-01","2025-06-01","2025-07-01","2025-08-01","2025-09-01","2025-10-01","2025-11-01",{"$f":"EU10","v":"2024-12-01"},{"$f":"FG11+1","v":"2025-01-01"},{"$f":"FH11+1","v":"2025-02-01"},"2025-03-01","2025-04-01","2025-05-01","2025-06-01","2025-07-01","2025-08-01","2025-09-01","2025-10-01","2025-11-01"]
{"$rows_left_out":54}
{"sheet":"Contador","index":1,"n_rows":2,"n_cols":6,"rows_kept":2,"cut":false,"hidden":true,"merged":[]}
[]
["expediente",0,null,null,null,"Verdadero"]

{"sheet":"Importes","index":2,"n_rows":43,"n_cols":17,"rows_kept":43,"cut":false,"hidden":true,"merged":[]}
["Códigos",null,"SMI",{"$f":"$K$1/30","v":37.799999999999997},{"$f":"D1/12*2","v":6.3},"Achega SMI1",{"$f":"$K$4/30","v":39.47},{"$f":"G1/12*2","v":6.58},"Achega SMI2","SMI 1",{"$f":"I17","v":1134},"cod",null,"tipo","tempo","nome","obxecto"]
[{"$f":"B2&C2","v":"0AM+E"},0,"AM+E",{"$f":"D3+D4","v":0.5},{"$f":"ROUND(D2*$D$1+$E$1*D2,2)","v":22.05},{"$f":"ROUND(D2*$I$17+$K$2*D2,2)","v":661.5},{"$f":"G3+H4","v":0.5},{"$f":"ROUND(G2*$G$1+$H$1*G2,2)","v":23.03},{"$f":"ROUND(D2*$I$18+$K$5*D2,2)","v":690.67},"Prorrata 2PE",{"$f":"K1/12*2","v":189},100,{"$f":"IF(N2=\"Indefinido\",\"Ind\",\"Temp\")","v":"Ind"},"Indefinido","TIEMPO COMPLETO","ORDINARIO"]
["0AM",0,"AM",0.5,{"$f":"ROUND(D3*$D$1,2)","v":18.899999999999999},{"$f":"ROUND(D3*$I$17,2)","v":567},0.5,{"$f":"ROUND(G3*$G$1,2)","v":19.739999999999998},{"$f":"ROUND(D3*$I$18,2)","v":592},null,null,109,{"$f":"IF(N3=\"Indefinido\",\"Ind\",\"Temp\")","v":"Ind"},"Indefinido","TIEMPO COMPLETO","FOMENTO CONTRATACIÓN INDEFINIDA / EMPLEO ESTABLE","TRANSFORMACIÓN CONTRATO Temporal"]
[null,null,null,null,null,null,null,null,null,"SMI 2",{"$f":"I18","v":1184},130,"Ind","Indefinido","TIEMPO COMPLETO","MINUSVÁLIDOS"]
[{"$f":"B5&C5","v":"0CP"},0,"CP",{"$f":"0.5/6","v":0.08},{"$f":"ROUND(D5*$D$1,2)","v":3.02},{"$f":"ROUND(D5*$I$17,2)","v":90.72},{"$f":"0.5/6","v":0.08},{"$f":"ROUND(G5*$G$1,2)","v":3.16},{"$f":"ROUND(D5*$I$18,2)","v":94.72},"Prorrata 2PE",{"$f":"K4/12*2","v":197.33},139,"Ind","Indefinido","TIEMPO COMPLETO","MINUSVÁLIDOS","TRANSFORMACIÓN CONTRATO Temporal"]
[{"$f":"B6&C6","v":"0CV"},0,"CV",0.5,{"$f":"ROUND(D6*$D$1,2)","v":18.899999999999999},{"$f":"ROUND(D6*$I$17,2)","v":567},0.5,{"$f":"ROUND(G6*$G$1,2)","v":19.739999999999998},{"$f":"ROUND(D6*$I$18,2)","v":592},null,null,150,"Ind","Indefinido","TIEMPO COMPLETO","FOMENTO CONTRATACIÓN INDEFINIDA / EMPLEO ESTABLE","INICIAL"]
["0CV+E",0,"CV+E",{"$f":"D3+D4","v":0.5},{"$f":"ROUND(D7*$D$1,2)","v":18.899999999999999},{"$f":"ROUND(D7*$I$17,2)","v":567},{"$f":"G3+G4","v":0.5},{"$f":"ROUND(G7*$G$1,2)","v":19.739999999999998},{"$f":"ROUND(D7*$I$18,2)","v":592},null,null,189,"Ind","Indefinido","TIEMPO COMPLETO",null,"TRANSFORMACIÓN CONTRATO Temporal"]
[null,null,null,null,null,null,null,null,null,null,null,200,"Ind","Indefinido","TIEMPO PARCIAL","ORDINARIO"]
["1AM+E",1,"AM+E",0.65,{"$f":"ROUND(D9*$D$1+$E$1*D9,2)","v":28.67},{"$f":"ROUND(D9*$I$17+$K$2*D9,2)","v":859.95},0.65,{"$f":"ROUND(G9*$G$1+$H$1*G9,2)","v":29.93},{"$f":"ROUND(D9*$I$18+$K$5*D9,2)","v":897.86},null,null,209,"Ind","Indefinido","TIEMPO PARCIAL","FOMENTO CONTRATACIÓN INDEFINIDA / EMPLEO ESTABLE","TRANSFORMACIÓN CONTRATO Temporal"]
["1AM",1,"AM",0.65,{"$f":"ROUND(D10*$D$1,2)","v":24.57},{"$f":"ROUND(D10*$I$17,2)","v":737.1},0.65,{"$f":"ROUND(G10*$G$1,2)","v":25.66},{"$f":"ROUND(D10*$I$18,2)","v":769.6},null,null,230,"Ind","Indefinido","TIEMPO PARCIAL","MINUSVÁLIDOS"]
{"$rows_left_out":34}
{"sheet":"Campos a Cubrir","index":3,"n_rows":54,"n_cols":10,"rows_kept":54,"cut":false,"hidden":true,"merged":[[0,0,0,6]]}
["Este modelo está en formato Excel e, polo tanto, aínda que pode ser cuberta utilizando LibreOffice, debe gardar os cambios no mesmo formato.",null,null,null,null,null,null,null,"I  M  P  O  R  T  A  N  T  E"]
[]
["A continuación describense os campos do formulario con indicación do tipo de campo, a súa descrición, si é un campo autocalculado e si se cubre ou non",null,null,null,null,null,null,null,"Este modelo de folla de cálculo tén celdas ocultas, e celdas con fórmulas (algunhas delas ocultas)"]
[null,null,null,null,null,null,null,null,"para inserir novas filas ou para borrar información deben terse en conta as seguintes"]
["Campo",null,"Tamaño","Tipo","Descrición",null,null,null,"recomendacións:"]
["Nº Exp",null,19,"Texto","Nº de Expediente administrativo asignado na convocatoria de axudas"]
["C.E.E.",null,50,"Texto","Nome do Centro Especial de Emprego",null,null,null,"Borrar información"]
["C.I.F.",null,9,"Texto","C.I.F. do Centro Especial de Emprego"]
["Nome da persoa representante",null,null,"Texto","Nome da persoa representate do Centro Especial de Emprego",null,null,null,"No caso de querer borrar a información dunha fila completamente debemos facelo"]
[null,null,null,null,null,null,null,null,"copiando na fila que queremos borrar  a inforación dunha fila que esté totalmente en"]
{"$rows_left_out":44}