{"text_format":"1","workbook":"xlsx","n_sheets":4,"sheets":["Certificación Relación Mensual","Importes","Contador","Campos a Cubrir"],"not_rendered":{"charts":0,"images":3,"macros":1,"external_links":0,"defined_names":4,"comments":0,"pivot_tables":0},"unopened":[],"bounds":{"document_bytes":16777216,"sheet_cells":100000,"rows_first":2000,"rows_last":500,"rows_between":2000,"halvings":0,"cell_chars":16384,"cell_head_chars":4096},"cells_cut":0,"cells_raw":0,"read":"whole","date_system":"1900"}

{"sheet":"Certificación Relación Mensual","index":0,"n_rows":63,"n_cols":107,"rows_kept":63,"cut":false,"hidden":false,"merged":[[7,6,7,7],[1,6,1,10],[2,6,2,10],[3,6,3,10],[8,20,8,21]]}
["IdN","ACHE","Proc","Num",null,"Meses",7,8,9,10,11,12,1,2,3,4,"Xornada","Achega","Dias","Contía","%CV","Diascv","Vacacións","NÓMINA",null,"IT","Baixa",null,null,null,null,null,null,null,null,"","","","","","",null,1,2,3,4,5,6,7,8,9,10,11,12,13,14,15,16,17,18,19,20,21,22,23,24,25,26,27,28,{"$f":"IF(DAY(VALUE(1&\"-\"&$AC$7&\"-\"&$AD$7)-1)>28,29,\"\")","v":29},{"$f":"IF(DAY(VALUE(1&\"-\"&$AC$7&\"-\"&$AD$7)-1)>29,30,\"\")","v":30},{"$f":"IF(DAY(VALUE(1&\"-\"&$AC$7&\"-\"&$AD$7)-1)>30,31,\"\")","v":31},"Trab.","Baixa",null,null,null,null,"inimes","finmes","diasnomina","diasbaixa","dbaixa","dalta","dbaixaat","dbaixait","Dias baixa mes","Diasconsumidos","Totdiasbaixa","ya subv.","Pedientes","DatainiCV","DiasCV","1ºS 3","resto","os 12","- os 3 1ºS","os 12","Pago","Alt","Baix","NÓMINA",null,null,"Data_nómina"]
["area de impresión",null,null,null,null,null,"C.E.E. Solicitante",null,null,null,null,null,null,null,null,null,null,null,null,null,null,null,null,null,null,null,null,null,null,null,null,null,null,null,null,"Xullo","Agosto","Setembro","Outubro","Novembro"]
["de",null,null,"A1",null,null,"DNI/NIF:",null,null,null,null,null,null,null,"NºExp",null,null,null,null,null,null," Certificación mensual da relación do cadro de persoal c/discapaciade",null,null,null,null,null,null,null,null,null,null,null,null,null,7,8,9,10,11]
["a",null,null,{"$f":"\"AV\"&IF(MAXA(A2:A60)=0,11,11+MAXA(A12:A60))","v":"AV11"},null,null,"Nome da persoa representante:",null,null,null,null,null,null,null,null,null,null,null,null,null,null,null,null,null,null,null,null,null,null,null,null,null,null,null,null,"Xullo","Agosto","Setembro","Outubro","Novembro"]
[null,null,null,null,null,null,"Tipo de Axuda: Subvencion para a financiación do custo salarial de todas a persoas traballadoras con discapacidade contratadas en C.E.E. do territorio da Comunadade Autónoma de Galicia",null,null,null,null,null,null,null,null,null,null,null,null,null,null,null,null,null,null,null,null,null,null,{"$f":"VALUE(1&\"-\"&$AC$7&\"-\"&$AD$7)-1","v":"2023-07-31"},null,null,null,null,null,null,null,null,null,null,null,{"$f":"IF(IFERROR(VLOOKUP(#REF!,$AC$12:$AC$60,1,FALSE),\"\")=\"\",\"\",1)","v":""}]
[null,null,null,null,null,"Desde",{"$f":"IF($AD$5=VALUE(30&\"/\"&6&\"/\"&YEAR($AD$5)),\"Verán\",IF($AD$5=VALUE(31&\"/\"&12&\"/\"&YEAR($AD$5)),\"Inverno\",\"\"))","v":""},"Data_nómina",null,null,null,null,null,"50%SMI","60%SMI",null,"Programa III: Programa de axudas ao mantemento do custo salarial nos C.E.E. (Procedemento TR341M)",null,null,null,null,null,null,null,null,null,null,null,"mes","ano",null,null,null,null,null,null,null,null,null,null,null,null,{"$f":"VALUE(AQ11&\"/\"&MONTH($AD$5)&\"/\"&YEAR($AD$5))","v":"2023-07-01"},"2023-07-02","2023-07-03","2023-07-04","2023-07-05","2023-07-06","2023-07-07","2023-07-08","2023-07-09","2023-07-10","2023-07-11","2023-07-12","2023-07-13","2023-07-14","2023-07-15","2023-07-16","2023-07-17","2023-07-18","2023-07-19","2023-07-20","2023-07-21","2023-07-22","2023-07-23","2023-07-24","2023-07-25","2023-07-26","2023-07-27","2023-07-28","2023-07-29","2023-07-30","2023-07-31",null,null,null,null,null,null,null,null,null,null,null,null,"SI(AK13=\"AT\";CO13;0)",null,null,null,null,null,null,null,null,null,null,null,"Convenio"]
["Novo ","Tot. Trab. CEE/RNT",null,null,null,"Certificación do cadro de ",null,{"$f":"VALUE(\"1/\"&HLOOKUP(G8,Z2:AN3,2,FALSE)&\"/\"&(IF(HLOOKUP(G8,Z2:AN3,2,FALSE)<7,YEAR(AA7)+1,YEAR(AA7))))","v":"2023-07-01"},null,"Certificación comprobada",null,null,"Si",{"$f":"COUNTIFS($I$11:$I$61,P7,$B$11:$B$61,0,$X$11:$X$61,\"SI\")","v":0},{"$f":"COUNTIFS($I$11:$I$61,P7,$B$11:$B$61,1,$X$11:$X$61,\"SI\")","v":0},"H","T. Achega mes",null,null,{"$f":"VALUE(SUBTOTAL(109,T11:T61))","v":0},"T.c.Vacacións",null,{"$f":"SUBTOTAL(9,W11:W61)","v":0},null,"Periodo",null,"2023-07-01",null,{"$f":"IF(MONTH(T8)+1>12,MONTH(T8)+1-12,MONTH(T8)+1)","v":8},{"$f":"IF(MONTH(T8)+1>12,YEAR(T8)+1,YEAR(T8))","v":2023},null,null,null,null,null,null,"Anexo X",null,null,null,null,null,null,null,null,null,null,null,null,null,null,null,null,null,null,null,null,null,null,null,null,null,null,null,null,null,null,null,null,null,null,null,null,null,null,"IT",15]
["IdX","% Trab. c/discap.",null,null,{"$f":"IFERROR(T9/E7,0)","v":0},"persoal do mes de ","Xullo",null,null,"Calculo correcto?",null,null,"Si",{"$f":"COUNTIFS($I$11:$I$61,P8,$B$11:$B$61,0,$X$11:$X$61,\"SI\")","v":0},{"$f":"COUNTIFS($I$11:$I$61,P8,$B$11:$B$61,1,$X$11:$X$61,\"SI\")","v":0},"M","T.P.Trab",null,{"$f":"SUM(N7:O8)","v":0},{"$f":"H7","v":"2023-07-01"},"Tot. Certificación mes de",null,null,null,"Convc.Axudas",null,null,{"$f":"(DAY(AA7)&\"/\"&(VALUE(MONTH(AA7))+5)&\"/\"&YEAR(AA7))-1","v":"2023-11-30"},"mes",null,null,null,null,null,null,null,null,null,null,null,null,null,null,null,null,null,null,null,null,null,null,null,null,null,null,null,null,null,null,null,null,null,null,null,null,null,null,null,null,null,null,null,null,null,null,"AT",1,null,{"$f":"CT8","v":"NON"},null,null,null,null,null,null,null,null,null,null,null,null,null,null,null,null,null,null,{"$f":"AB9","v":"NON"}]
[{"$f":"MAXA(A11:A61)+1","v":1},"G","Cod","Salario mes","Nº Rexistro",null,null,null,null,null,null,null,null,null,null,null,"Tot. P. Trab. mes",null,null,{"$f":"COUNTIF(X11:X61,\"SI\")","v":0},{"$f":"G8","v":"Xullo"},null,{"$f":"W7+T7","v":0},null,null,null,"Conv. IT","NON",null,null,null,null,null,null,null,null,null,null,null,null,null,null,null,null,null,null,null,null,null,null,null,null,null,null,null,null,null,null,null,null,null,null,null,null,null,null,null,null,null,null,null,null,null,null,null,"Total","Días","Días","Días"]
["IdX",null,null,"Convenio","ou data pub","Traballador",null,"Data",null,null,null,null,"Data","Data","Código","Tipo ","%","Tipo",null,"Achega","%",null,"Comp.",null,"Dias","IT","I T  /  A T",null,"Conv",null,null,null,"Xust",null,"INF.","Copia ","Comun.","Anexo",null,null,"Anexo",null,"C","A","L","E","N","D","A","R","I","O",null,"D","E",null,"T","R","A","B","A","L","L","O",null,"D","O",null,"M","E","S",null,null,"Días","Días","Días","Baixa","Baixa","Baixa",null,null,null,null,null,null,null,null,null,null,null,null,null,null,null,"tres primeros"]
["IdN","D","RNT","Colectivo","Conv. Colect","(Apelido1 Apelido2, Nome)","N.I.F.","Nacemento","sexo","Discapacidade","Grao","Tipo","Alta ","Baixa","Contrato","Cont","Xornada","Achega","Días","Mensual","Xornada2","Días3","Vacacións","Certific4","Absentism","AT","Baixa5","Alta","Baixa6","Interindade","Observacións","Nómina","Pago","TC2","IDC","Cto","SEPE","XI","IDC7","TA2","XII","Columna8","1","2","3","4","5","6","7","8","9","10","11","12","13","14","15","16","17","18","19","20","21","22","23","24","25","26","27","28","29","30","31","Trab.","Baixa9","Baixa10","Acum ","xa sub","Pend","inimes","finmes","diasnomina","diasbaixa","dbaixa","dalta","dbaixaat","dbaixait","Dias baixa mes","Diasconsumidos","Totdiasbaixa","ya subv.","Pedientes","DatainiCV","DiasCV","1ºS 3","resto","os 12","- os 3 1ºS","os 1211","Pago12","Alt","Baix","Certific","52","105","Data_nómina","Columna13"]
[null,{"$f":"IF(AND(J12=\"\",K12=\"\"),\"\",IF(K12>=65,1,IF(AND(K12>=33,OR(J12=\"P. Cerebral\",J12=\"Enf. Mental\",J12=\"D. Intelectual\",J12=\"Psíquica\")),1,0)))","v":""},{"$f":"IFERROR(MID(F12,1,2)&(MID(F12,FIND(\" \",F12,1)+1,2))&IFERROR((MID(F12,FIND(\",\",F12,1)+2,1)),MID(F12,FIND(\" \",F12,FIND(\" \",F12,1)+1)+1,1)),\"\")","v":""},null,null,null,null,null,null,null,null,null,null,"",null,{"$f":"IFERROR(VLOOKUP(O12,Importes!K:P,2,FALSE),\"\")","v":""},null,"AM+E",{"$f":"IFERROR(IF(OR(CV12=\"AAINT\",CV12=\"ALINT\",CV12=\"AA\",CV12=\"AL\"),CD12,\"\"),\"\")","v":0},{"$f":"IFERROR(ROUND(IF(MOD(S12,30)=0,QUOTIENT(S12,30)*VLOOKUP(B12&\"AM+E\",Importes!$A$2:$F$14,6,FALSE)*(IF($Q12>100,0,$Q12)/100),S12*VLOOKUP(B12&\"AM+E\",Importes!$A$2:$F$14,5,FALSE)*(IF($Q12>100,0,$Q12)/100)),2),0)","v":0},{"$f":"IFERROR(IF(V12=\"\",\"\",Q12),\"\")","v":""},{"$f":"IFERROR(IF(OR(CV12=\"ALINT\",CV12=\"AL\"),CP12,\"\"),\"\")","v":""},{"$f":"IF(V12=\"\",\"\",IF(V12>0,ROUND(IF(MOD(V12,30)=0,QUOTIENT(V12,30)*VLOOKUP(B12&\"AM+E\",Importes!$A$2:$F$14,6,FALSE)*(IF($U12>100,0,$U12)/100),V12*VLOOKUP(B12&\"AM+E\",Importes!$A$2:$F$14,5,FALSE)*(IF($U12>100,0,$U12)/100)),2),0))","v":""},{"$f":"IFERROR(IF(CY12=\"NO\",\"\",CY12),\"\")","v":""},null,null,{"$f":"IF(Z12=\"IT\",M12,IF(Z12=\"AT\",M12,\"\"))","v":""},{"$f":"IF(AND(AA12<>\"\",N12>0),N12,\"\")","v":""},"Si",null,"",{"$f":"IF($T12>0,\"X\",\"\")","v":""},"","","","","","","","","",{"$f":"IF(IFERROR(VLOOKUP(G12,$AD$12:$AD$60,1,FALSE),\"\")=\"\",\"\",1)","v":""},{"$f":"IF(VALUE($A12)=0,\"\",IF(AQ$11=\"\",\"\",IF($N12<AQ$6,\"\",IF($M12>AQ$6,\"\",IF(AND(OR($N12=\"\",$N12>=AQ$6),$AA12=\"\",$R12<>\"\"),\"F\",IF(AND($AA12<=AQ$6,OR($AB12=$N12,$AB12>=AQ$6,IF($AB12=\"\",$AD$5))),\"h\",IF($CC12>=AQ$6,\"F\",\"\")))))))","v":""},"","","","","","","","","",{"$f":"IF(VALUE($A12)=0,\"\",IF(BA$11=\"\",\"\",IF($N12<BA$6,\"\",IF($M12>BA$6,\"\",IF(AND(OR($N12=\"\",$N12>=BA$6),$AA12=\"\",$R12<>\"\"),\"F\",IF(AND($AA12<=BA$6,OR($AB12=$N12,$AB12>=BA$6,IF($AB12=\"\",$AD$5))),\"h\",IF($CC12>=BA$6,\"F\",\"\")))))))","v":""},"","","","","","","","","",{"$f":"IF(VALUE($A12)=0,\"\",IF(BK$11=\"\",\"\",IF($N12<BK$6,\"\",IF($M12>BK$6,\"\",IF(AND(OR($N12=\"\",$N12>=BK$6),$AA12=\"\",$R12<>\"\"),\"F\",IF(AND($AA12<=BK$6,OR($AB12=$N12,$AB12>=BK$6,IF($AB12=\"\",$AD$5))),\"h\",IF($CC12>=BK$6,\"F\",\"\")))))))","v":""},"","","","","","","","","","",{"$f":"IF(COUNTIF(AP12:BU12,\"F\")=0,0,COUNTIF(AP12:BU12,\"F\"))","v":0},{"$f":"IF(COUNTIF(AP12:BU12,\"h\")=0,0,COUNTIF(AP12:BU12,\"h\"))","v":0},{"$f":"IF(OR(Z12=\"IT\",Z12=\"AT\"),CG12+1-(CF12),0)","v":0},{"$f":"IF(Z12=\"AT\",1,IF(IF(Z12=\"IT\",CG12+1-(CF12),0)>15,15,IF(Z12=\"IT\",CG12+1-(CF12),0)))","v":0},{"$f":"IF(Z12=\"IT\",IF(BX12-BW12>15,15,BX12-BW12),IF(Z12=\"AT\",IF(BX12-BW12>1,1,BX12-BW12),0))","v":0},{"$f":"IF(OR(AC12=\"SI\",$CA$8=\"SI\"),BY12-BZ12,IF(AND(AC12<>\"SI\",OR($CA$8=\"NON\",$CA$8=\"<<>>\")),IF(BZ12<=3,IF(BY12-BZ12-3<=0,IF(Z12=\"AT\",IF(BZ12=1,0,1),0),BY12-BZ12-(3-BZ12)),BY12-BZ12),0))","v":0},{"$f":"IF(M12<$T$8,$T$8,M12)","v":"2023-07-01"},{"$f":"IF(N12=\"\",$AD$5,N12)","v":"2023-07-31"},{"$f":"IF(BV12+CE12>30,30,IF(AND(MONTH($H$7)=2,BV12>=DAY($AD$5),OR(AA12=\"\",AA12<=$H$7)),30,IF(BV12+CA12>30,30,BV12+CA12)))","v":0},{"$f":"CN12","v":0},{"$f":"IF(Z12=\"at\",IF(CH12<$AA$7,CH12,IF(CH12<$T$8,$T$8-1,CH12)),CI12)","v":"2023-01-01"},{"$f":"IF(OR(AB12=\"\",AB12>$AD$5),IF(N12=\"\",$AD$5,IF(N12>$AD$5,$AD$5,N12)),AB12)","v":"2023-07-31"},{"$f":"IF(Z12=\"AT\",CI12,0)","v":"00:00:00"},{"$f":"IF(IF(AA12=\"\",0,AA12)+3=3,VALUE(1&\"-\"&1&\"-\"&$AD$7),AA12)","v":"2023-01-01"},{"$f":"BW12","v":0},{"$f":"IF(OR(Z12=\"IT\",Z12=\"AT\"),IF(CF12<CB12,CB12-(CF12),0),0)","v":0},{"$f":"IF(OR(Z12=\"IT\",Z12=\"AT\"),CG12+1-(CF12),0)","v":0},{"$f":"IF(OR(Z12=\"IT\",Z12=\"AT\"),IF(CK12>=15,12,IF(CK12<15,CK12,CK12-3)),0)","v":0},{"$f":"IF(AND(Z12=\"AT\",CL12-CJ12=0),1,IF(Z12=\"IT\",CU12,0))","v":0},{"$f":"IF(M12<VALUE(1&\"-\"&1&\"-\"&IF(YEAR($AD$5)<$AD$7,YEAR($AD$5),$AD$7)),VALUE(1&\"-\"&1&\"-\"&IF(YEAR($AD$5)<$AD$7,YEAR($AD$5),$AD$7)),M12)","v":"2023-01-01"},{"$f":"IF(N12=\"\",0,(DAYS360(CO12,N12)+1)/30*2.5)","v":0},{"$f":"IF(CM12>=3,3,CM12)","v":0},{"$f":"IF(OR($CT$8=\"SI\",$AC12=\"SI\"),CQ12,3-CQ12)","v":0},{"$f":"IF(CK12>15,IF(OR($CT$8=\"SI\",$AC12=\"SI\"),15,12),IF(OR($CT$8=\"SI\",$AC12=\"SI\"),CK12,CK12-CQ12))","v":0},{"$f":"IF(CL12-CR12-CQ12<0,0,IF(CL12-CR12-CQ12>12,IF(OR($CT$8=\"SI\",$AC12=\"SI\"),15,12),IF(CL12-CR12-CQ12>BW12,BW12-CR12,CL12-CR12-CQ12)))","v":0},{"$f":"IF(CT12-CS12>=IF(OR($CT$8=\"SI\",$AC12=\"SI\"),15,12),IF(OR($CT$8=\"SI\",$AC12=\"SI\"),15,12),CT12-CS12)","v":0},{"$f":"CW12&CX12&IF(OR(O12=510,O12=410),\"INT\",\"\")","v":"AA"},{"$f":"IF(YEAR(M12)<YEAR($H$7),\"A\",IF(YEAR(M12)=YEAR($H$7),IF(MONTH(M12)<=MONTH($H$7),\"A\",\"NO\")))","v":"A"},{"$f":"IF(N12=\"\",\"A\",IF(YEAR(N12)>YEAR($H$7),\"A\",IF(YEAR(N12)=YEAR($H$7),IF(MONTH(N12)>MONTH($H$7),\"A\",IF(MONTH(N12)=MONTH($H$7),\"L\",\"B\")))))","v":"A"},{"$f":"IFERROR(IF(L12<33,\"NO\",IF(OR(CV12=\"AA\",CV12=\"AL\"),\"SI\",IF(OR(CV12=\"AAINT\",CV12=\"ALINT\"),\"SI\"))),\"\")","v":"NO"},{"$f":"IF(COLUMN()>0,5,5)","v":5},{"$f":"IFERROR(IF(AND(F12>0,G12>0),7,0),7)","v":0},{"$f":"IFERROR(IF(CY12=\"SI\",$H$7,\"\"),0)","v":""}]
[null,{"$f":"IF(AND(J13=\"\",K13=\"\"),\"\",IF(K13>=65,1,IF(AND(K13>=33,OR(J13=\"P. Cerebral\",J13=\"Enf. Mental\",J13=\"D. Intelectual\",J13=\"Psíquica\")),1,0)))","v":""},{"$f":"IFERROR(MID(F13,1,2)&(MID(F13,FIND(\" \",F13,1)+1,2))&IFERROR((MID(F13,FIND(\",\",F13,1)+2,1)),MID(F13,FIND(\" \",F13,FIND(\" \",F13,1)+1)+1,1)),\"\")","v":""},null,null,null,null,null,null,null,null,null,null,"",null,{"$f":"IFERROR(VLOOKUP(O13,Importes!K:P,2,FALSE),\"\")","v":""},null,"AM+E",0,{"$f":"IFERROR(ROUND(IF(MOD(S13,30)=0,QUOTIENT(S13,30)*VLOOKUP(B13&\"AM+E\",Importes!$A$2:$F$14,6,FALSE)*(IF($Q13>100,0,$Q13)/100),S13*VLOOKUP(B13&\"AM+E\",Importes!$A$2:$F$14,5,FALSE)*(IF($Q13>100,0,$Q13)/100)),2),0)","v":0},"","",{"$f":"IF(V13=\"\",\"\",IF(V13>0,ROUND(IF(MOD(V13,30)=0,QUOTIENT(V13,30)*VLOOKUP(B13&\"AM+E\",Importes!$A$2:$F$14,6,FALSE)*(IF($U13>100,0,$U13)/100),V13*VLOOKUP(B13&\"AM+E\",Importes!$A$2:$F$14,5,FALSE)*(IF($U13>100,0,$U13)/100)),2),0))","v":""},"",null,null,"","","Si",null,"","","","","","","","","","","","","","","","","","","","","","","","","","","","","","","","","","","","","","","","","","","",{"$f":"IF(COUNTIF(AP13:BU13,\"F\")=0,0,COUNTIF(AP13:BU13,\"F\"))","v":0},{"$f":"IF(COUNTIF(AP13:BU13,\"h\")=0,0,COUNTIF(AP13:BU13,\"h\"))","v":0},0,0,0,0,"2023-07-01","2023-07-31",0,{"$f":"CN13","v":0},"2023-01-01","2023-07-31","00:00:00","2023-01-01",{"$f":"BW13","v":0},0,0,0,0,"2023-01-01",0,0,0,0,0,0,"AA","A","A","NO",5,{"$f":"IFERROR(IF(AND(F13>0,G13>0),7,0),7)","v":0},{"$f":"IFERROR(IF(CY13=\"SI\",$H$7,\"\"),0)","v":""}]
[null,"","",null,null,null,null,null,null,null,null,null,null,"",null,{"$f":"IFERROR(VLOOKUP(O14,Importes!K:P,2,FALSE),\"\")","v":""},null,"AM+E",0,{"$f":"IFERROR(ROUND(IF(MOD(S14,30)=0,QUOTIENT(S14,30)*VLOOKUP(B14&\"AM+E\",Importes!$A$2:$F$14,6,FALSE)*(IF($Q14>100,0,$Q14)/100),S14*VLOOKUP(B14&\"AM+E\",Importes!$A$2:$F$14,5,FALSE)*(IF($Q14>100,0,$Q14)/100)),2),0)","v":0},{"$f":"IFERROR(IF(V14=\"\",\"\",Q14),\"\")","v":""},{"$f":"IFERROR(IF(OR(CV14=\"ALINT\",CV14=\"AL\"),CP14,\"\"),\"\")","v":""},{"$f":"IF(V14=\"\",\"\",IF(V14>0,ROUND(IF(MOD(V14,30)=0,QUOTIENT(V14,30)*VLOOKUP(B14&\"AM+E\",Importes!$A$2:$F$14,6,FALSE)*(IF($U14>100,0,$U14)/100),V14*VLOOKUP(B14&\"AM+E\",Importes!$A$2:$F$14,5,FALSE)*(IF($U14>100,0,$U14)/100)),2),0))","v":""},{"$f":"IFERROR(IF(CY14=\"NO\",\"\",CY14),\"\")","v":""},null,null,{"$f":"IF(Z14=\"IT\",M14,IF(Z14=\"AT\",M14,\"\"))","v":""},{"$f":"IF(AND(AA14<>\"\",N14>0),N14,\"\")","v":""},"Si",null,"","","","","","","","","","","","","","","","","","","","","","","","","","","","","","","","","","","","","","","","","","","",0,0,0,0,0,0,"2023-07-01","2023-07-31",0,0,"2023-01-01","2023-07-31","00:00:00","2023-01-01",0,0,0,0,0,"2023-01-01",0,0,0,0,0,0,"AA","A","A","NO",5,0,""]
[null,"","",null,null,null,null,null,null,null,null,null,null,"",null,{"$f":"IFERROR(VLOOKUP(O15,Importes!K:P,2,FALSE),\"\")","v":""},null,"AM+E",0,{"$f":"IFERROR(ROUND(IF(MOD(S15,30)=0,QUOTIENT(S15,30)*VLOOKUP(B15&\"AM+E\",Importes!$A$2:$F$14,6,FALSE)*(IF($Q15>100,0,$Q15)/100),S15*VLOOKUP(B15&\"AM+E\",Importes!$A$2:$F$14,5,FALSE)*(IF($Q15>100,0,$Q15)/100)),2),0)","v":0},"","",{"$f":"IF(V15=\"\",\"\",IF(V15>0,ROUND(IF(MOD(V15,30)=0,QUOTIENT(V15,30)*VLOOKUP(B15&\"AM+E\",Importes!$A$2:$F$14,6,FALSE)*(IF($U15>100,0,$U15)/100),V15*VLOOKUP(B15&\"AM+E\",Importes!$A$2:$F$14,5,FALSE)*(IF($U15>100,0,$U15)/100)),2),0))","v":""},"",null,null,"","","Si",null,"","","","","","","","","","","","","","","","","","","","","","","","","","","","","","","","","","","","","","","","","","","",0,0,0,0,0,0,"2023-07-01","2023-07-31",0,0,"2023-01-01","2023-07-31","00:00:00","2023-01-01",0,0,0,0,0,"2023-01-01",0,0,0,0,0,0,"AA","A","A","NO",5,0,""]
{"$rows_left_out":49}
{"sheet":"Importes","index":1,"n_rows":43,"n_cols":16,"rows_kept":43,"cut":false,"hidden":true,"merged":[]}
["Códigos",null,"SMI 2018",{"$f":"H1/30","v":36},{"$f":"D1/12*2","v":6},"Achega/mes","SMI 2019",1080,null,null,"cod",null,"tipo","tempo","nome","obxecto"]
[{"$f":"B2&C2","v":"0AM+E"},0,"AM+E",{"$f":"D3+D4","v":0.5},{"$f":"ROUND(D2*$D$1+$E$1*D2,2)","v":21},{"$f":"ROUND(D2*$H$1+$I$2*D2,2)","v":630},null,"Prorrata 2PE",{"$f":"H1/12*2","v":180},null,100,{"$f":"IF(M2=\"Indefinido\",\"Ind\",\"Temp\")","v":"Ind"},"Indefinido","TIEMPO COMPLETO","ORDINARIO"]
["0AM",0,"AM",0.5,{"$f":"ROUND(D3*$D$1,2)","v":18},{"$f":"ROUND(D3*$H$1,2)","v":540},null,null,null,null,109,{"$f":"IF(M3=\"Indefinido\",\"Ind\",\"Temp\")","v":"Ind"},"Indefinido","TIEMPO COMPLETO","FOMENTO CONTRATACIÓN INDEFINIDA / EMPLEO ESTABLE","TRANSFORMACIÓN CONTRATO Temporal"]
[null,null,null,null,null,null,null,null,null,null,130,"Ind","Indefinido","TIEMPO COMPLETO","MINUSVÁLIDOS"]
[{"$f":"B5&C5","v":"0CP"},0,"CP",{"$f":"0.5/6","v":0.08},{"$f":"ROUND(D5*$D$1,2)","v":2.88},{"$f":"ROUND(D5*$H$1,2)","v":86.4},null,null,null,null,139,"Ind","Indefinido","TIEMPO COMPLETO","MINUSVÁLIDOS","TRANSFORMACIÓN CONTRATO Temporal"]
[{"$f":"B6&C6","v":"0CV"},0,"CV",0.5,{"$f":"ROUND(D6*$D$1,2)","v":18},{"$f":"ROUND(D6*$H$1,2)","v":540},null,null,null,null,150,"Ind","Indefinido","TIEMPO COMPLETO","FOMENTO CONTRATACIÓN INDEFINIDA / EMPLEO ESTABLE","INICIAL"]
["0CV+E",0,"CV+E",{"$f":"D3+D4","v":0.5},18,540,null,null,null,null,189,"Ind","Indefinido","TIEMPO COMPLETO",null,"TRANSFORMACIÓN CONTRATO Temporal"]
[null,null,null,null,null,null,null,null,null,null,200,"Ind","Indefinido","TIEMPO PARCIAL","ORDINARIO"]
["1AM+E",1,"AM+E",0.6,{"$f":"ROUND(D9*$D$1+$E$1*D9,2)","v":25.2},{"$f":"ROUND(D9*$H$1+$I$2*D9,2)","v":756},null,null,null,null,209,"Ind","Indefinido","TIEMPO PARCIAL","FOMENTO CONTRATACIÓN INDEFINIDA / EMPLEO ESTABLE","TRANSFORMACIÓN CONTRATO Temporal"]
["1AM",1,"AM",0.6,{"$f":"ROUND(D10*$D$1,2)","v":21.6},{"$f":"ROUND(D10*$H$1,2)","v":648},null,null,null,null,230,"Ind","Indefinido","TIEMPO PARCIAL","MINUSVÁLIDOS"]
[null,null,null,null,null,null,null,null,null,null,239,"Ind","Indefinido","TIEMPO PARCIAL","MINUSVÁLIDOS","TRANSFORMACIÓN CONTRATO Temporal"]
["1CP",1,"CP",{"$f":"0.6/6","v":0.1},{"$f":"ROUND(D12*$D$1,2)","v":3.6},{"$f":"ROUND(D12*$H$1,2)","v":108},null,null,null,null,250,"Ind","Indefinido","TIEMPO PARCIAL","FOMENTO CONTRATACIÓN INDEFINIDA / EMPLEO ESTABLE","INICIAL"]
["1CV",1,"CV",0.6,{"$f":"ROUND(D13*$D$1,2)","v":21.6},{"$f":"ROUND(D13*$H$1,2)","v":648},null,null,null,null,289,"Ind","Indefinido","TIEMPO PARCIAL",null,"TRANSFORMACIÓN CONTRATO Temporal"]
["1CV+E",1,"CV+E",0.6,{"$f":"ROUND(D14*$D$1+$E$1*D14,2)","v":25.2},{"$f":"ROUND(D14*$H$1+$I$2*D14,2)","v":756},null,null,null,null,300,"Ind","Indefinido","FIJO/DISCONTINUO"]
[null,null,null,null,null,null,null,null,null,null,309,"Ind","Indefinido","FIJO/DISCONTINUO","FOMENTO CONTRATACIÓN INDEFINIDA / EMPLEO ESTABLE","TRANSFORMACIÓN CONTRATO Temporal"]
{"$rows_left_out":29}
{"sheet":"Contador","index":2,"n_rows":2,"n_cols":6,"rows_kept":2,"cut":false,"hidden":true,"merged":[]}
[]
["expediente",0,null,null,null,"Verdadero"]

{"sheet":"Campos a Cubrir","index":3,"n_rows":54,"n_cols":10,"rows_kept":54,"cut":false,"hidden":true,"merged":[[0,0,0,6]]}
["Este modelo está en formato Excel e, polo tanto, aínda que pode ser cuberta utilizando LibreOffice, debe gardar os cambios no mesmo formato.",null,null,null,null,null,null,null,"I  M  P  O  R  T  A  N  T  E"]
[]
["A continuación describense os campos do formulario con indicación do tipo de campo, a súa descrición, si é un campo autocalculado e si se cubre ou non",null,null,null,null,null,null,null,"Este modelo de folla de cálculo tén celdas ocultas, e celdas con fórmulas (algunhas delas ocultas)"]
[null,null,null,null,null,null,null,null,"para inserir novas filas ou para borrar información deben terse en conta as seguintes"]
["Campo",null,"Tamaño","Tipo","Descrición",null,null,null,"recomendacións:"]
["Nº Exp",null,19,"Texto","Nº de Expediente administrativo asignado na convocatoria de axudas"]
["C.E.E.",null,50,"Texto","Nome do Centro Especial de Emprego",null,null,null,"Borrar información"]
["C.I.F.",null,9,"Texto","C.I.F. do Centro Especial de Emprego"]
["Nome da persoa representante",null,null,"Texto","Nome da persoa representate do Centro Especial de Emprego",null,null,null,"No caso de querer borrar a información dunha fila completamente debemos facelo"]
[null,null,null,null,null,null,null,null,"copiando na fila que queremos borrar  a inforación dunha fila que esté totalmente en"]
["Novo Idx",null,null,"Numérico","Suxire o nº de índice polo que se vincularía a alta dunha nova persoa traballadora ","Non se cubre","Autocalculado",null,"blanco, xa que así conservamos a formulas de cálculo ocultas cos seus valores correctos."]
["Tot. Trab. CEE/RNT",null,null,"Numérico","Nº de persoas traballadoras que aparecen no RNT do mes que se certifica"]
["Certificación do cadro de persoal do mes de ",null,null,"Texto","lista despregable donde se escolle o mes que se vai a certificar",null,null,null,"Para facer esto temos que marcar a fila en blanco a copiar (totalmente) facendo a selección "]
["Certificación comprobada",null,null,"Texto","lista despregable donde se indica que a certificación esta totalmente correcta","(Por omisión ten o valor \"SI\")",null,null,"desde o número indicativo da fila (non desde unha celda), seleccionar a opción de copiar e"]
["Calculo correcto",null,null,"Texto","lista despregable donde se indica que os calculos feitos son correctos","(Por omisión ten o valor \"SI\")",null,null,"posicionarnos a celda que corresponda co Idx/Idn da fila a borrar, e logo pegar a información "]
{"$rows_left_out":39}