{"text_format":"1","workbook":"xlsx","n_sheets":4,"sheets":["Certificación Relación Anual ","Contador","Códigos","Campos a cubrir"],"not_rendered":{"charts":0,"images":3,"macros":1,"external_links":0,"defined_names":4,"comments":0,"pivot_tables":0},"unopened":[],"bounds":{"document_bytes":16777216,"sheet_cells":100000,"rows_first":2000,"rows_last":500,"rows_between":2000,"halvings":0,"cell_chars":16384,"cell_head_chars":4096},"cells_cut":0,"cells_raw":0,"read":"whole","date_system":"1900"}

{"sheet":"Certificación Relación Anual ","index":0,"n_rows":38,"n_cols":53,"rows_kept":38,"cut":false,"hidden":false,"merged":[[0,7,0,11],[1,7,1,11],[2,7,2,11]]}
[null,null,null,null,null,null,null,"C.E.E. Solicitante"]
[null,null,null,null,null,null,null,"DNI/NIF:",null,null,null,null,null,null,null,null,null,null,null,null,null,null,"NºExp"]
[null,null,null,null,null,null,null,"Nome da persoa representante:"]
[null,null,null,null,null,null,null,"Programa III: Programa de axudas ao mantemento do custo salarial nos C.E.E. (Procedemento TR341M)"]
[null,null,null,null,null,null,null,"Tipo de Axuda: Subvencion para a financiación do custo salarial de todas a persoas traballadoras con discapacidade contratadas en C.E.E. do territorio da Comunidade Autónoma de Galicia"]
["RELACIÓN PERSOAL CON DISCAPACIDADE",null,null,null,null," Convocatoria de Axudas","desde","hasta",null,"P.Trab. Subvencionadas",null,"60% SMI","50% SMI","Tot. Persoas","1º mes de",null,null,"    Total Periodo",null,"Total Certificación",null,null,"CERTIFICACIÓN DA RELACIÓN DO",null,null,null,null,null,null,null,null,null,null,null,null,null,null,null,null,"fin"]
[null,{"$f":"\"MES DE XULLO DE \"&YEAR(G7)","v":"MES DE XULLO DE 2023"},null,null,null,"Periodo subvencionable","2023-07-01",{"$f":"(DAY(G7)&\"/\"&(VALUE(MONTH(G7))+5)&\"/\"&YEAR(G7))-1","v":"2023-11-30"},null,"Homes",null,{"$f":"COUNTIFS(I10:I36,\"H\",E10:E36,1)","v":0},{"$f":"COUNTIFS(I10:I36,\"H\",E10:E36,0)","v":0}," Traballadoras","Solicitude",null,{"$f":"IF(MONTH(G7)=7,\"Xullo\",\"\")","v":"Xullo"},null,{"$f":"SUBTOTAL(9,S11:S36)","v":0},"   Relación Anual",null,null,"CADRO DE PERSOAL POLO CAL SE ",null,null,null,null,null,7,8,9,10,11]
["Novo\nIdX","nº Rexistro ","Salario",null,null,null,{"$f":"H7+1","v":"2023-12-01"},{"$f":"H7","v":"2023-11-30"},null,"Mulleres",null,{"$f":"COUNTIFS(I10:I36,\"M\",E10:E36,1)","v":0},{"$f":"COUNTIFS(I10:I36,\"M\",E10:E36,0)","v":0},{"$f":"SUM(L7:M8)","v":0},null,null,null,null,null,null,{"$f":"SUBTOTAL(9,U11:U36)","v":0},null,"SOLICITA A SUBV.DO CUSTO SALARIAL",null,null,null,null,null,{"$f":"$G$7","v":"2023-07-01"},{"$f":"AC9+1","v":"2023-08-01"},{"$f":"AD9+1","v":"2023-09-01"},"2023-10-01","2023-11-01",null,null,null,null,null,null,{"$f":"$G$7","v":"2023-07-01"},{"$f":"AN9+1","v":"2023-08-01"},{"$f":"AO9+1","v":"2023-09-01"},{"$f":"AP9+1","v":"2023-10-01"},{"$f":"AQ9+1","v":"2023-11-01"},null,null,null,null,null,5,{"$f":"COLUMN()","v":51}]
[{"$f":"MAXA(A11:A36)+1","v":1},"ou data pub.","Convenio","Conv","G",null,null,"Data",null,null,null,null,"Data","Data","  Cóntrato",null,"%","             Anualidade",null,null,"Total ",null,"Dias","Período subvención",null,null,null,null,{"$f":"(1&\"/\"&IF(MONTH(AC8)+1>12,12-MONTH(AC8)+1,(MONTH(AC8)+1)&\"/\"&IF(MONTH(AC8)+1>12,YEAR(AC8)+1,YEAR(AC8))))-1","v":"2023-07-31"},{"$f":"(1&\"/\"&IF(MONTH(AD8)+1>12,12-MONTH(AD8)+1,(MONTH(AD8)+1)&\"/\"&IF(MONTH(AD8)+1>12,YEAR(AD8)+1,YEAR(AD8))))-1","v":"2023-08-31"},{"$f":"(1&\"/\"&IF(MONTH(AE8)+1>12,12-MONTH(AE8)+1,(MONTH(AE8)+1)&\"/\"&IF(MONTH(AE8)+1>12,YEAR(AE8)+1,YEAR(AE8))))-1","v":"2023-09-30"},"2023-10-31","2023-11-30","DiaIni","MesIni","AñoIni","DiaFin","MesFin","AñoFin",{"$f":"(1&\"/\"&IF(MONTH(AN8)+1>12,12-MONTH(AN8)+1,(MONTH(AN8)+1)&\"/\"&IF(MONTH(AN8)+1>12,YEAR(AN8)+1,YEAR(AN8))))-1","v":"2023-07-31"},{"$f":"(1&\"/\"&IF(MONTH(AO8)+1>12,12-MONTH(AO8)+1,(MONTH(AO8)+1)&\"/\"&IF(MONTH(AO8)+1>12,YEAR(AO8)+1,YEAR(AO8))))-1","v":"2023-08-31"},{"$f":"(1&\"/\"&IF(MONTH(AP8)+1>12,12-MONTH(AP8)+1,(MONTH(AP8)+1)&\"/\"&IF(MONTH(AP8)+1>12,YEAR(AP8)+1,YEAR(AP8))))-1","v":"2023-09-30"},"2023-10-31","2023-11-30"]
["IdX","Conv. Col","Colectivo","Baixa","D","Traballador","N.I.F.","Nacemento","Sexo","Discapacidade","Grao","Tipo","Alta","Baixa2","Código","Tipo ","Xornada","Días","Achega Sol."," ","  ","   ","Periodo","7","8","9","10","11","Columna6","Columna7","Columna8","Columna9","Columna10","Columna11","Columna12","Columna13","Columna14","Columna15","Columna16","Columna17","Columna18","Columna19","Columna20","Columna21","ini periodo 1º","fin periodo 1º","Dias periodo 1º","Columna22","TotDias1º","5","Columna24","Observacións","Columna25"]
[null,null,null,null,{"$f":"IF(J11=\"\",\"\",IF(K11>=65,1,IF(AND(K11>=33,OR(J11=\"P. Cerebral\",J11=\"Enf. Mental\",J11=\"D. Intelectual\",J11=\"Psíquica\")),1,0)))","v":""},null,null,null,null,null,null,null,null,null,null,{"$f":"IFERROR(VLOOKUP(O11,Códigos!K:N,2,FALSE),\"\")","v":""},null,{"$f":"IF(AND(OR(O11=402,O11=502),N11=\"\"),\"\",IF(BA11=1,\"\",W11))","v":""},{"$f":"IF(AND(OR(O11=402,O11=502),N11=\"\"),\"\",IF(BA11=1,\"\",IFERROR(IF(AW11=\"\",\"\",IF(AW11>0,(AW11*VLOOKUP(E11&\"AM+E\",Códigos!$A$2:$F$14,5,FALSE)*(IF($Q11>100,0,$Q11)/100)),0)),0)))","v":0},null,{"$f":"IFERROR(IF(IF(S11=\"\",0,S11)+IF(T11=\"\",0,T11)=0,\"\",IF(S11=\"\",0,S11)+IF(T11=\"\",0,T11)),\"\")","v":""},null,{"$f":"IFERROR(IF(SUM(X11:AB11)=0,\"\",SUM(X11:AB11)),\"\")","v":""},{"$f":"IF(OR(AC11=0,AN11=0),\"\",IF(AN11-AC11+1>30,30,AN11-AC11+1))","v":""},{"$f":"IF(OR(AD11=0,AO11=0),\"\",IF(AO11-AD11+1>30,30,AO11-AD11+1))","v":""},{"$f":"IF(OR(AE11=0,AP11=0),\"\",IF(AP11-AE11+1>30,30,AP11-AE11+1))","v":""},{"$f":"IF(OR(AF11=0,AQ11=0),\"\",IF(AQ11-AF11+1>30,30,AQ11-AF11+1))","v":""},{"$f":"IF(OR(AG11=0,AR11=0),\"\",IF(AR11-AG11+1>30,30,AR11-AG11+1))","v":""},{"$f":"IF($M11=\"\",0,IF($M11<=AC$8,1,IF(YEAR($M11)=YEAR(AC$8),IF(MONTH($M11)=MONTH(AC$8),DAY($M11),0))))","v":0},0,0,0,0,{"$f":"IF(M11=\"\",DAY($G$7),DAY(M11))","v":1},{"$f":"IF(M11=\"\",MONTH($G$7),MONTH(M11))","v":7},{"$f":"IF(M11=\"\",YEAR($G$7),YEAR(M11))","v":2023},{"$f":"IFERROR(IF(N11=\"\",DAY($H$7),DAY(N11)),DAY($H$7))","v":30},{"$f":"IFERROR(IF(N11=\"\",MONTH($H$7),MONTH(N11)),MONTH($H$7))","v":11},{"$f":"IFERROR(IF(N11=\"\",YEAR($H$7),YEAR(N11)),YEAR($H$7))","v":2023},{"$f":"IF($N11=\"\",DAY(AN$9),IF($N11>=AN$9,DAY(AN$9),IF(MONTH($N11)=MONTH(AN$9),DAY($N11),0)))","v":31},31,30,31,30,{"$f":"IF(M11<=$G$7,$G$7,IF(AND(M11>$G$7,M11<=$H$7),M11,IF(M11>$H$7,1)))","v":"2023-07-01"},{"$f":"IF(N11=\"\",$H$7,N11)","v":"2023-11-30"},{"$f":"DAYS360(AS11-1,AT11)","v":150},{"$f":"IF(AU11=W11,\"Ok\",\"\")","v":""},{"$f":"AU11","v":150},{"$f":"IF(COLUMN()>0,5,5)","v":5},{"$f":"IFERROR(IF(AND(F11>0,G11>0),7,0),7)","v":0},null,{"$f":"IF(IFERROR(VLOOKUP(AZ11,$G$10:$G$35,1,0),\"\")=\"\",\"\",1)","v":""}]
[null,null,null,null,"",null,null,null,null,null,null,null,null,null,null,{"$f":"IFERROR(VLOOKUP(O12,Códigos!K:N,2,FALSE),\"\")","v":""},null,{"$f":"IF(AND(OR(O12=402,O12=502),N12=\"\"),\"\",IF(BA12=1,\"\",W12))","v":""},{"$f":"IF(AND(OR(O12=402,O12=502),N12=\"\"),\"\",IF(BA12=1,\"\",IFERROR(IF(AW12=\"\",\"\",IF(AW12>0,(AW12*VLOOKUP(E12&\"AM+E\",Códigos!$A$2:$F$14,5,FALSE)*(IF($Q12>100,0,$Q12)/100)),0)),0)))","v":0},null,{"$f":"IFERROR(IF(IF(S12=\"\",0,S12)+IF(T12=\"\",0,T12)=0,\"\",IF(S12=\"\",0,S12)+IF(T12=\"\",0,T12)),\"\")","v":""},null,{"$f":"IFERROR(IF(SUM(X12:AB12)=0,\"\",SUM(X12:AB12)),\"\")","v":""},{"$f":"IF(OR(AC12=0,AN12=0),\"\",IF(AN12-AC12+1>30,30,AN12-AC12+1))","v":""},"","","","",0,0,0,0,0,{"$f":"IF(M12=\"\",DAY($G$7),DAY(M12))","v":1},{"$f":"IF(M12=\"\",MONTH($G$7),MONTH(M12))","v":7},{"$f":"IF(M12=\"\",YEAR($G$7),YEAR(M12))","v":2023},{"$f":"IFERROR(IF(N12=\"\",DAY($H$7),DAY(N12)),DAY($H$7))","v":30},{"$f":"IFERROR(IF(N12=\"\",MONTH($H$7),MONTH(N12)),MONTH($H$7))","v":11},{"$f":"IFERROR(IF(N12=\"\",YEAR($H$7),YEAR(N12)),YEAR($H$7))","v":2023},31,31,30,31,30,{"$f":"IF(M12<=$G$7,$G$7,IF(AND(M12>$G$7,M12<=$H$7),M12,IF(M12>$H$7,1)))","v":"2023-07-01"},"2023-11-30",{"$f":"DAYS360(AS12-1,AT12)","v":150},{"$f":"IF(AU12=W12,\"Ok\",\"\")","v":""},{"$f":"AU12","v":150},5,{"$f":"IFERROR(IF(AND(F12>0,G12>0),7,0),7)","v":0},null,""]
[null,null,null,null,"",null,null,null,null,null,null,null,null,null,null,{"$f":"IFERROR(VLOOKUP(O13,Códigos!K:N,2,FALSE),\"\")","v":""},null,{"$f":"IF(AND(OR(O13=402,O13=502),N13=\"\"),\"\",IF(BA13=1,\"\",W13))","v":""},{"$f":"IF(AND(OR(O13=402,O13=502),N13=\"\"),\"\",IF(BA13=1,\"\",IFERROR(IF(AW13=\"\",\"\",IF(AW13>0,(AW13*VLOOKUP(E13&\"AM+E\",Códigos!$A$2:$F$14,5,FALSE)*(IF($Q13>100,0,$Q13)/100)),0)),0)))","v":0},null,{"$f":"IFERROR(IF(IF(S13=\"\",0,S13)+IF(T13=\"\",0,T13)=0,\"\",IF(S13=\"\",0,S13)+IF(T13=\"\",0,T13)),\"\")","v":""},null,{"$f":"IFERROR(IF(SUM(X13:AB13)=0,\"\",SUM(X13:AB13)),\"\")","v":""},{"$f":"IF(OR(AC13=0,AN13=0),\"\",IF(AN13-AC13+1>30,30,AN13-AC13+1))","v":""},{"$f":"IF(OR(AD13=0,AO13=0),\"\",IF(AO13-AD13+1>30,30,AO13-AD13+1))","v":""},{"$f":"IF(OR(AE13=0,AP13=0),\"\",IF(AP13-AE13+1>30,30,AP13-AE13+1))","v":""},{"$f":"IF(OR(AF13=0,AQ13=0),\"\",IF(AQ13-AF13+1>30,30,AQ13-AF13+1))","v":""},{"$f":"IF(OR(AG13=0,AR13=0),\"\",IF(AR13-AG13+1>30,30,AR13-AG13+1))","v":""},{"$f":"IF($M13=\"\",0,IF($M13<=AC$8,1,IF(YEAR($M13)=YEAR(AC$8),IF(MONTH($M13)=MONTH(AC$8),DAY($M13),0))))","v":0},{"$f":"IF($M13=\"\",0,IF($M13<=AD$8,1,IF(YEAR($M13)=YEAR(AD$8),IF(MONTH($M13)=MONTH(AD$8),DAY($M13),0))))","v":0},{"$f":"IF($M13=\"\",0,IF($M13<=AE$8,1,IF(YEAR($M13)=YEAR(AE$8),IF(MONTH($M13)=MONTH(AE$8),DAY($M13),0))))","v":0},{"$f":"IF($M13=\"\",0,IF($M13<=AF$8,1,IF(YEAR($M13)=YEAR(AF$8),IF(MONTH($M13)=MONTH(AF$8),DAY($M13),0))))","v":0},{"$f":"IF($M13=\"\",0,IF($M13<=AG$8,1,IF(YEAR($M13)=YEAR(AG$8),IF(MONTH($M13)=MONTH(AG$8),DAY($M13),0))))","v":0},{"$f":"IF(M13=\"\",DAY($G$7),DAY(M13))","v":1},{"$f":"IF(M13=\"\",MONTH($G$7),MONTH(M13))","v":7},{"$f":"IF(M13=\"\",YEAR($G$7),YEAR(M13))","v":2023},{"$f":"IFERROR(IF(N13=\"\",DAY($H$7),DAY(N13)),DAY($H$7))","v":30},{"$f":"IFERROR(IF(N13=\"\",MONTH($H$7),MONTH(N13)),MONTH($H$7))","v":11},{"$f":"IFERROR(IF(N13=\"\",YEAR($H$7),YEAR(N13)),YEAR($H$7))","v":2023},{"$f":"IF($N13=\"\",DAY(AN$9),IF($N13>=AN$9,DAY(AN$9),IF(MONTH($N13)=MONTH(AN$9),DAY($N13),0)))","v":31},{"$f":"IF($N13=\"\",DAY(AO$9),IF($N13>=AO$9,DAY(AO$9),IF(MONTH($N13)=MONTH(AO$9),DAY($N13),0)))","v":31},{"$f":"IF($N13=\"\",DAY(AP$9),IF($N13>=AP$9,DAY(AP$9),IF(MONTH($N13)=MONTH(AP$9),DAY($N13),0)))","v":30},{"$f":"IF($N13=\"\",DAY(AQ$9),IF($N13>=AQ$9,DAY(AQ$9),IF(MONTH($N13)=MONTH(AQ$9),DAY($N13),0)))","v":31},{"$f":"IF($N13=\"\",DAY(AR$9),IF($N13>=AR$9,DAY(AR$9),IF(MONTH($N13)=MONTH(AR$9),DAY($N13),0)))","v":30},{"$f":"IF(M13<=$G$7,$G$7,IF(AND(M13>$G$7,M13<=$H$7),M13,IF(M13>$H$7,1)))","v":"2023-07-01"},"2023-11-30",{"$f":"DAYS360(AS13-1,AT13)","v":150},{"$f":"IF(AU13=W13,\"Ok\",\"\")","v":""},{"$f":"AU13","v":150},5,0,null,{"$f":"IF(IFERROR(VLOOKUP(AZ13,$G$10:$G$35,1,0),\"\")=\"\",\"\",1)","v":""}]
[null,null,null,null,"",null,null,null,null,null,null,null,null,null,null,{"$f":"IFERROR(VLOOKUP(O14,Códigos!K:N,2,FALSE),\"\")","v":""},null,{"$f":"IF(AND(OR(O14=402,O14=502),N14=\"\"),\"\",IF(BA14=1,\"\",W14))","v":""},{"$f":"IF(AND(OR(O14=402,O14=502),N14=\"\"),\"\",IF(BA14=1,\"\",IFERROR(IF(AW14=\"\",\"\",IF(AW14>0,(AW14*VLOOKUP(E14&\"AM+E\",Códigos!$A$2:$F$14,5,FALSE)*(IF($Q14>100,0,$Q14)/100)),0)),0)))","v":0},null,{"$f":"IFERROR(IF(IF(S14=\"\",0,S14)+IF(T14=\"\",0,T14)=0,\"\",IF(S14=\"\",0,S14)+IF(T14=\"\",0,T14)),\"\")","v":""},null,{"$f":"IFERROR(IF(SUM(X14:AB14)=0,\"\",SUM(X14:AB14)),\"\")","v":""},"","","","","",0,0,0,0,0,1,7,2023,{"$f":"IFERROR(IF(N14=\"\",DAY($H$7),DAY(N14)),DAY($H$7))","v":30},{"$f":"IFERROR(IF(N14=\"\",MONTH($H$7),MONTH(N14)),MONTH($H$7))","v":11},{"$f":"IFERROR(IF(N14=\"\",YEAR($H$7),YEAR(N14)),YEAR($H$7))","v":2023},31,31,30,31,30,{"$f":"IF(M14<=$G$7,$G$7,IF(AND(M14>$G$7,M14<=$H$7),M14,IF(M14>$H$7,1)))","v":"2023-07-01"},"2023-11-30",{"$f":"DAYS360(AS14-1,AT14)","v":150},{"$f":"IF(AU14=W14,\"Ok\",\"\")","v":""},{"$f":"AU14","v":150},5,0,null,""]
[null,null,null,null,"",null,null,null,null,null,null,null,null,null,null,{"$f":"IFERROR(VLOOKUP(O15,Códigos!K:N,2,FALSE),\"\")","v":""},null,"",{"$f":"IF(AND(OR(O15=402,O15=502),N15=\"\"),\"\",IF(BA15=1,\"\",IFERROR(IF(AW15=\"\",\"\",IF(AW15>0,(AW15*VLOOKUP(E15&\"AM+E\",Códigos!$A$2:$F$14,5,FALSE)*(IF($Q15>100,0,$Q15)/100)),0)),0)))","v":0},null,"",null,{"$f":"IFERROR(IF(SUM(X15:AB15)=0,\"\",SUM(X15:AB15)),\"\")","v":""},"","","","","",0,0,0,0,0,1,7,2023,30,11,2023,31,31,30,31,30,"2023-07-01","2023-11-30",{"$f":"DAYS360(AS15-1,AT15)","v":150},"",150,5,0,null,""]
[null,null,null,null,"",null,null,null,null,null,null,null,null,null,null,{"$f":"IFERROR(VLOOKUP(O16,Códigos!K:N,2,FALSE),\"\")","v":""},null,"",{"$f":"IF(AND(OR(O16=402,O16=502),N16=\"\"),\"\",IF(BA16=1,\"\",IFERROR(IF(AW16=\"\",\"\",IF(AW16>0,(AW16*VLOOKUP(E16&\"AM+E\",Códigos!$A$2:$F$14,5,FALSE)*(IF($Q16>100,0,$Q16)/100)),0)),0)))","v":0},null,"",null,"","","","","","",0,0,0,0,0,1,7,2023,30,11,2023,31,31,30,31,30,"2023-07-01","2023-11-30",150,"",150,5,0,null,""]
[null,null,null,null,"",null,null,null,null,null,null,null,null,null,null,{"$f":"IFERROR(VLOOKUP(O17,Códigos!K:N,2,FALSE),\"\")","v":""},null,"",{"$f":"IF(AND(OR(O17=402,O17=502),N17=\"\"),\"\",IF(BA17=1,\"\",IFERROR(IF(AW17=\"\",\"\",IF(AW17>0,(AW17*VLOOKUP(E17&\"AM+E\",Códigos!$A$2:$F$14,5,FALSE)*(IF($Q17>100,0,$Q17)/100)),0)),0)))","v":0},null,"",null,"","","","","","",0,0,0,0,0,1,7,2023,30,11,2023,31,31,30,31,30,"2023-07-01","2023-11-30",150,"",150,5,{"$f":"IFERROR(IF(AND(F17>0,G17>0),7,0),7)","v":0},null,""]
[null,null,null,null,"",null,null,null,null,null,null,null,null,null,null,{"$f":"IFERROR(VLOOKUP(O18,Códigos!K:N,2,FALSE),\"\")","v":""},null,"",{"$f":"IF(AND(OR(O18=402,O18=502),N18=\"\"),\"\",IF(BA18=1,\"\",IFERROR(IF(AW18=\"\",\"\",IF(AW18>0,(AW18*VLOOKUP(E18&\"AM+E\",Códigos!$A$2:$F$14,5,FALSE)*(IF($Q18>100,0,$Q18)/100)),0)),0)))","v":0},null,"",null,"","","","","","",0,0,0,0,0,1,7,2023,30,11,2023,31,31,30,31,30,"2023-07-01","2023-11-30",150,"",150,5,0,null,""]
[null,null,null,null,"",null,null,null,null,null,null,null,null,null,null,{"$f":"IFERROR(VLOOKUP(O19,Códigos!K:N,2,FALSE),\"\")","v":""},null,"",{"$f":"IF(AND(OR(O19=402,O19=502),N19=\"\"),\"\",IF(BA19=1,\"\",IFERROR(IF(AW19=\"\",\"\",IF(AW19>0,(AW19*VLOOKUP(E19&\"AM+E\",Códigos!$A$2:$F$14,5,FALSE)*(IF($Q19>100,0,$Q19)/100)),0)),0)))","v":0},null,"",null,"","","","","","",0,0,0,0,0,1,7,2023,30,11,2023,31,31,30,31,30,"2023-07-01","2023-11-30",150,"",150,5,0,null,""]
[null,null,null,null,"",null,null,null,null,null,null,null,null,null,null,null,null,"",{"$f":"IF(AND(OR(O20=402,O20=502),N20=\"\"),\"\",IF(BA20=1,\"\",IFERROR(IF(AW20=\"\",\"\",IF(AW20>0,(AW20*VLOOKUP(E20&\"AM+E\",Códigos!$A$2:$F$14,5,FALSE)*(IF($Q20>100,0,$Q20)/100)),0)),0)))","v":0},null,"",null,"","","","","","",0,0,0,0,0,1,7,2023,30,11,2023,31,31,30,31,30,"2023-07-01","2023-11-30",150,"",150,5,{"$f":"IFERROR(IF(AND(F20>0,G20>0),7,0),7)","v":0},null,""]
{"$rows_left_out":19}
{"sheet":"Contador","index":1,"n_rows":2,"n_cols":6,"rows_kept":2,"cut":false,"hidden":true,"merged":[]}
[]
["expediente",0,null,null,null,"Verdadero"]

{"sheet":"Códigos","index":2,"n_rows":43,"n_cols":16,"rows_kept":43,"cut":false,"hidden":true,"merged":[]}
["Códigos",null,"SMI 2018",{"$f":"H1/30","v":36},{"$f":"D1/12*2","v":6},"Achega/mes","SMI 2019",1080,null,null,"cod",null,"tipo","tempo","nome","obxecto"]
[{"$f":"B2&C2","v":"0AM+E"},0,"AM+E",{"$f":"D3+D4","v":0.5},{"$f":"ROUND(D2*$D$1+$E$1*D2,2)","v":21},{"$f":"ROUND(D2*$H$1+$I$2*D2,2)","v":630},null,"Prorrata 2PE",{"$f":"H1/12*2","v":180},null,100,{"$f":"IF(M2=\"Indefinido\",\"Ind\",\"Temp\")","v":"Ind"},"Indefinido","TIEMPO COMPLETO","ORDINARIO"]
["0AM",0,"AM",0.5,{"$f":"ROUND(D3*$D$1,2)","v":18},{"$f":"ROUND(D3*$H$1,2)","v":540},null,null,null,null,109,{"$f":"IF(M3=\"Indefinido\",\"Ind\",\"Temp\")","v":"Ind"},"Indefinido","TIEMPO COMPLETO","FOMENTO CONTRATACIÓN INDEFINIDA / EMPLEO ESTABLE","TRANSFORMACIÓN CONTRATO Temporal"]
[null,null,null,null,null,null,null,null,null,null,130,"Ind","Indefinido","TIEMPO COMPLETO","MINUSVÁLIDOS"]
[{"$f":"B5&C5","v":"0CP"},0,"CP",{"$f":"0.5/6","v":0.08},{"$f":"ROUND(D5*$D$1,2)","v":2.88},{"$f":"ROUND(D5*$H$1,2)","v":86.4},null,null,null,null,139,"Ind","Indefinido","TIEMPO COMPLETO","MINUSVÁLIDOS","TRANSFORMACIÓN CONTRATO Temporal"]
[{"$f":"B6&C6","v":"0CV"},0,"CV",0.5,{"$f":"ROUND(D6*$D$1,2)","v":18},{"$f":"ROUND(D6*$H$1,2)","v":540},null,null,null,null,150,"Ind","Indefinido","TIEMPO COMPLETO","FOMENTO CONTRATACIÓN INDEFINIDA / EMPLEO ESTABLE","INICIAL"]
["0CV+E",0,"CV+E",{"$f":"D3+D4","v":0.5},{"$f":"ROUND(D7*$D$1,2)","v":18},{"$f":"ROUND(D7*$H$1,2)","v":540},null,null,null,null,189,"Ind","Indefinido","TIEMPO COMPLETO",null,"TRANSFORMACIÓN CONTRATO Temporal"]
[null,null,null,null,null,null,null,null,null,null,200,"Ind","Indefinido","TIEMPO PARCIAL","ORDINARIO"]
["1AM+E",1,"AM+E",0.6,{"$f":"ROUND(D9*$D$1+$E$1*D9,2)","v":25.2},{"$f":"ROUND(D9*$H$1+$I$2*D9,2)","v":756},null,null,null,null,209,"Ind","Indefinido","TIEMPO PARCIAL","FOMENTO CONTRATACIÓN INDEFINIDA / EMPLEO ESTABLE","TRANSFORMACIÓN CONTRATO Temporal"]
["1AM",1,"AM",0.6,{"$f":"ROUND(D10*$D$1,2)","v":21.6},{"$f":"ROUND(D10*$H$1,2)","v":648},null,null,null,null,230,"Ind","Indefinido","TIEMPO PARCIAL","MINUSVÁLIDOS"]
[null,null,null,null,null,null,null,null,null,null,239,"Ind","Indefinido","TIEMPO PARCIAL","MINUSVÁLIDOS","TRANSFORMACIÓN CONTRATO Temporal"]
["1CP",1,"CP",{"$f":"0.6/6","v":0.1},{"$f":"ROUND(D12*$D$1,2)","v":3.6},{"$f":"ROUND(D12*$H$1,2)","v":108},null,null,null,null,250,"Ind","Indefinido","TIEMPO PARCIAL","FOMENTO CONTRATACIÓN INDEFINIDA / EMPLEO ESTABLE","INICIAL"]
["1CV",1,"CV",0.6,{"$f":"ROUND(D13*$D$1,2)","v":21.6},{"$f":"ROUND(D13*$H$1,2)","v":648},null,null,null,null,289,"Ind","Indefinido","TIEMPO PARCIAL",null,"TRANSFORMACIÓN CONTRATO Temporal"]
["1CV+E",1,"CV+E",0.6,{"$f":"ROUND(D14*$D$1+$E$1*D14,2)","v":25.2},{"$f":"ROUND(D14*$H$1+$I$2*D14,2)","v":756},null,null,null,null,300,"Ind","Indefinido","FIJO/DISCONTINUO"]
[null,null,null,null,null,null,null,null,null,null,309,"Ind","Indefinido","FIJO/DISCONTINUO","FOMENTO CONTRATACIÓN INDEFINIDA / EMPLEO ESTABLE","TRANSFORMACIÓN CONTRATO Temporal"]
["Minusvalía",null,"Tipo ",null,null,null,null,null,null,null,330,"Ind","Indefinido","FIJO/DISCONTINUO","MINUSVÁLIDOS"]
["Pensionista",null,"minus",null,null,null,null,null,null,null,350,"Ind","Indefinido","FIJO/DISCONTINUO","FOMENTO CONTRATACIÓN INDEFINIDA / EMPLEO ESTABLE","INICIAL"]
["Definitiva",null,"Física",null,null,null,null,null,null,null,389,"Ind","Indefinido","FIJO/DISCONTINUO",null,"TRANSFORMACIÓN CONTRATO Temporal"]
["Provisional",null,"Sensorial",null,null,null,null,null,null,null,401,"Temp","Duración Determinada","TIEMPO COMPLETO","OBRA O SERVICIO DETERMINADO"]
[" ",null,"P. Cerebral",null,null,null,null,null,null,null,402,"Temp","Duración Determinada","TIEMPO COMPLETO","EVENTUAL POR CIRCUNSTANCIAS DE LA PRODUCCIÓN"]
{"$rows_left_out":24}
{"sheet":"Campos a cubrir","index":3,"n_rows":47,"n_cols":10,"rows_kept":47,"cut":false,"hidden":true,"merged":[[0,0,0,6],[23,5,23,6]]}
["Este modelo está en formato Excel e, polo tanto, aínda que pode ser cuberta utilizando LibreOffice, debe gardar os cambios no mesmo formato.",null,null,null,null,null,null,null,"I  M  P  O  R  T  A  N  T  E"]
[]
["A continuación describense os campos do formulario con indicación do tipo de campo, a súa descrición, si é un campo autocalculado e si se cubre ou non",null,null,null,null,null,null,null,"Este modelo de folla de cálculo tén celdas ocultas, e celdas con fórmulas (algunhas delas ocultas)"]
[null,null,null,null,null,null,null,null,"para inserir novas filas ou para borrar información deben terse en conta as seguintes"]
["Campo",null,"Tamaño","Tipo","Descrición",null,null,null,"recomendacións:"]
["Nº Exp",null,19,"Texto","Nº de Expediente administrativo asignado na convocatoria de axudas ","Non é un campo obrigatorio"]
["C.E.E.",null,50,"Texto","Nome do Centro Especial de Emprego",null,null,null,"Borrar información"]
["C.I.F.",null,9,"Texto","C.I.F. do Centro Especial de Emprego"]
["Novo Idx",null,null,"Numérico","Suxire o nº de índice polo que se vincularía a alta dunha nova persoa traballadora ","Non se cubre","Autocalculado",null,"No caso de querer borrar a información dunha fila completamente debemos facelo"]
["Idx",null,3,"Numérico","Indicaría o nº de índice polo que se vincularía á persoa traballadora (é único para cada traballador e contrato de traballo)",null,null,null,"copiando na fila que queremos borrar  a inforación dunha fila que esté totalmente en"]
["Nº Rexistro ou data publicación C.C.",null,3,"Texto","Nº de Rexistro ou data de publicación do convenio colectivo de aplicación ó traballador",null,null,null,"blanco, xa que así conservamos a formulas de cálculo ocultas cos seus valores correctos."]
["Salario/mes Convenio Colectivo",null,null,"Numérico","Importe mensual do salario bruto a percibir por cada traballador"]
["Conv. Baixa",null,null,"Texto","lista despregable para indicar si os calculos das baixas por enfermidade correspondense co que dispoña a normativa da Seguridade Social ou si hai un convenio colectivo de aplicación específica",null,null,null,"Para facer esto temos que marcar a fila en blanco a copiar (totalmente) facendo a selección "]
["G D",null,1,"Numérico","Permite determinar si pola persoa traballadora se precibe una subvención do 50 % do SMI ou si se prima cun 10 % adicional determinado na orde de convocatoria de axudas","Non se cubre","Autocalculado",null,"desde o número indicativo da fila (non desde unha celda), seleccionar a opción de copiar e"]
["Traballador",null,50,"Texto","Apelidos e nome da persoa traballadora",null,null,null,"posicionarnos a celda que corresponda co Idx/Idn da fila a borrar, e logo pegar a información "]
["D.N.I.",null,9,"Texto","Documento Nacional de Identidade da persoa traballadora",null,null,null,"seleccionada.  Desta maneira aseguramonos de que todas as formulas, ocultas ou non, se "]
["Data Nacemento",null,6,"Data\ndd/mm/aa","Data de nacemento",null,null,null,"copian correctamente na fila que acabamos de borrar "]
["Sexo",null,1,"Texto","Sexo"]
["Discapacidade",null,14,"Texto","Tipo de discapacidade. Lista despregable cos seguintes valores (Física, Sensorial, P. Cerebral, Enf. Mental, D. Intelectual, Psíquica)",null,null,null,"Inserir novas filas para engadir datos de novas persoas traballadoras "]
["Grao",null,4,"Numérico","% de discapacidade da persoa traballadora",null,null,null,"Para facer insercións correctamente debemos:"]
{"$rows_left_out":27}